{"text_format":"1","workbook":"xlsx","n_sheets":7,"sheets":["Dolny układ jezdny","Obliczenia-dolny","OVERLINE","Overline - Obliczenia","QUANTUM","Quantum - obliczenia","Opisy"],"not_rendered":{"charts":0,"images":54,"macros":1,"external_links":0,"defined_names":59,"comments":0,"pivot_tables":0},"unopened":[],"bounds":{"document_bytes":16777216,"sheet_cells":100000,"rows_first":2000,"rows_last":500,"rows_between":2000,"halvings":0,"cell_chars":16384,"cell_head_chars":4096},"cells_cut":0,"cells_raw":0,"read":"whole","date_system":"1900"}

{"sheet":"Dolny układ jezdny","index":0,"n_rows":70,"n_cols":13,"rows_kept":70,"cut":false,"hidden":false,"merged":[[59,11,61,11],[52,12,55,12],[54,8,55,8],[55,2,55,4],[53,2,53,6],[54,2,54,6],[51,4,51,6],[52,8,53,8],[52,11,55,11],[56,11,58,11],[54,9,55,9],[52,10,55,10],[56,10,58,10],[52,9,53,9],[63,2,69,6],[56,2,56,4],[61,2,61,4],[62,2,62,4],[59,2,59,4],[60,2,60,6],[57,2,57,6],[58,2,58,4],[34,2,34,12],[9,10,11,10],[18,12,20,12],[18,11,20,11],[12,10,14,10],[9,11,11,11],[12,12,14,12],[18,10,20,10],[12,11,14,11],[15,10,17,10],[15,11,17,11],[15,12,17,12],[18,4,19,4],[21,2,26,4],[33,3,33,8],[6,3,6,4],[10,2,10,3],[16,2,16,3],[28,2,28,4],[28,5,28,12],[9,12,11,12]]}
[]
[]
[]
[]
[]
[]
[null,null,{"$f":"Opisy!A15","v":"Vyber profil"}]
[]
["1."]
[]
[null,null,{"$f":"Opisy!A18","v":"Rozmery otvoru"},null,null,"SD",{"$f":"HLOOKUP('Obliczenia-dolny'!$B$44,'Obliczenia-dolny'!$L$1:$AK$46,5,FALSE)","v":851},{"$f":"Opisy!$A$50","v":"mm"},{"$f":"Opisy!A55","v":"Šírka dverí"}]
["2.",null,{"$f":"Opisy!A22","v":"WO [mm]"},2500,{"$f":"IF(D12>2740,Opisy!A19,IF(D12<1000,Opisy!A20,Opisy!A21))","v":"<- OK"},"WD",{"$f":"HLOOKUP('Obliczenia-dolny'!$B$44,'Obliczenia-dolny'!$L$1:$AK$46,6,FALSE)","v":2460},{"$f":"Opisy!$A$50","v":"mm"},{"$f":"Opisy!A56","v":"Výška dverí"}]
["3.",null,{"$f":"Opisy!A23","v":"SO [mm]"},2500,{"$f":"IF(AND('Obliczenia-dolny'!C44='Obliczenia-dolny'!B11,'Dolny układ jezdny'!D13>3000),Opisy!A80,IF(D13>6000,Opisy!A24,IF(D13<1000,Opisy!A20,Opisy!A21)))","v":"<- OK"},"SW18",{"$f":"HLOOKUP('Obliczenia-dolny'!$B$44,'Obliczenia-dolny'!$L$1:$AK$46,7,FALSE)","v":844},{"$f":"Opisy!$A$50","v":"mm"},{"$f":"Opisy!A57","v":"Výplň 18mm"}]
[null,null,null,null,null,"SW16",{"$f":"HLOOKUP('Obliczenia-dolny'!$B$44,'Obliczenia-dolny'!$L$1:$AK$46,8,FALSE)","v":"-"},{"$f":"Opisy!$A$50","v":"mm"},{"$f":"Opisy!A58","v":"Výplň 16mm"}]
[null,null,null,null,null,"SW12",{"$f":"HLOOKUP('Obliczenia-dolny'!$B$44,'Obliczenia-dolny'!$L$1:$AK$46,9,FALSE)","v":"-"},{"$f":"Opisy!$A$50","v":"mm"},{"$f":"Opisy!A59","v":"Výplň 12mm"}]
{"$rows_left_out":56}
{"sheet":"Obliczenia-dolny","index":1,"n_rows":46,"n_cols":39,"rows_kept":46,"cut":false,"hidden":true,"merged":[[23,38,27,38],[23,11,23,36],[24,11,24,36],[0,38,3,38],[1,12,1,14],[1,15,1,16],[1,22,1,23],[1,26,1,28],[1,29,1,30],[1,31,1,32],[25,11,25,36],[26,11,26,36],[27,11,27,36],[29,11,29,36],[0,3,0,6],[4,3,4,6],[25,5,26,7],[1,5,2,5],[1,3,2,4],[1,24,1,25]]}
[1,"ERGO 18mm",null,"Wybór rozwiązania ze szczotką",null,null,null,null,{"$f":"L6/L5","v":2.8907168037602822},null,1,1,4,5,13,2,3,12,18,19,23,24,6,14,26,27,7,8,15,9,16,10,17,20,21,22,11,1,"Aktualnie wybrany system"]
[2,"NOVO II 18mm",null,true,null,{"$f":"IF(D2,3,0)","v":3},"Tak",null,null,"rączka",2,"ERGO","NOVO",null,null,"NOVO II",null,null,null,"NOVO 10","71 ARCO","85 FALDA","VISTA",null,"LOCA",null,"COTE",null,null,"NERO",null,"CARO",null,"FORM","TRAFO","FlatLine","Mito/Mito+",2]
[3,"NOVO II 12+4mm",null,null,null,null,"Nie",null,null,"system",3,"18mm","18mm","16mm","18/4mm","18mm","12+4mm","-","-","10/4mm","10/4mm",{"$f":"U3","v":"10/4mm"},"18mm","18/4mm",{"$f":"W3","v":"18mm"},{"$f":"X3","v":"18/4mm"},"18mm","16mm","18/4mm","18mm","18/4mm","18mm","18/4mm","10/4mm","10/4mm","10/4mm","10/4mm",3]
[4,"NOVO S 18mm",null,null,null,null,null,null,null,"waga 1mb. [kg]",4,0.219,0.33800000000000002,0.33800000000000002,0.33800000000000002,0.33200000000000002,0.33200000000000002,"-","-",0.35,0.41799999999999998,0.46300000000000002,0.38,0.38,0.48199999999999998,0.48199999999999998,0.35699999999999998,0.35699999999999998,0.35699999999999998,0.39300000000000002,0.39300000000000002,0.41399999999999998,0.41399999999999998,0.36199999999999999,0.34100000000000003,0.40500000000000003,0,4]
[5,"NOVO S 16mm",null,"Łączniki",null,null,null,null,null,"SD",5,{"$f":"IF($D$2,('Dolny układ jezdny'!$D$13-3+'Dolny układ jezdny'!$D$19*L21)/'Dolny układ jezdny'!$D$18,('Dolny układ jezdny'!$D$13+'Dolny układ jezdny'!$D$19*L21)/'Dolny układ jezdny'!$D$18)","v":851},{"$f":"IF($D$2,('Dolny układ jezdny'!$D$13-3+'Dolny układ jezdny'!$D$19*M21)/'Dolny układ jezdny'!$D$18,('Dolny układ jezdny'!$D$13+'Dolny układ jezdny'!$D$19*M21)/'Dolny układ jezdny'!$D$18)","v":855},{"$f":"IF($D$2,('Dolny układ jezdny'!$D$13-3+'Dolny układ jezdny'!$D$19*N21)/'Dolny układ jezdny'!$D$18,('Dolny układ jezdny'!$D$13+'Dolny układ jezdny'!$D$19*N21)/'Dolny układ jezdny'!$D$18)","v":855},{"$f":"IF($D$2,('Dolny układ jezdny'!$D$13-3+'Dolny układ jezdny'!$D$19*O21)/'Dolny układ jezdny'!$D$18,('Dolny układ jezdny'!$D$13+'Dolny układ jezdny'!$D$19*O21)/'Dolny układ jezdny'!$D$18)","v":855},{"$f":"IF($D$2,('Dolny układ jezdny'!$D$13-3+'Dolny układ jezdny'!$D$19*P21)/'Dolny układ jezdny'!$D$18,('Dolny układ jezdny'!$D$13+'Dolny układ jezdny'!$D$19*P21)/'Dolny układ jezdny'!$D$18)","v":855},{"$f":"IF($D$2,('Dolny układ jezdny'!$D$13-3+'Dolny układ jezdny'!$D$19*Q21)/'Dolny układ jezdny'!$D$18,('Dolny układ jezdny'!$D$13+'Dolny układ jezdny'!$D$19*Q21)/'Dolny układ jezdny'!$D$18)","v":855},"-","-",{"$f":"IF($D$2,('Dolny układ jezdny'!$D$13-3+'Dolny układ jezdny'!$D$19*T21)/'Dolny układ jezdny'!$D$18,('Dolny układ jezdny'!$D$13+'Dolny układ jezdny'!$D$19*T21)/'Dolny układ jezdny'!$D$18)","v":852.33333333333337},{"$f":"IF($D$2,('Dolny układ jezdny'!$D$13-3+'Dolny układ jezdny'!$D$19*U21)/'Dolny układ jezdny'!$D$18,('Dolny układ jezdny'!$D$13+'Dolny układ jezdny'!$D$19*U21)/'Dolny układ jezdny'!$D$18)","v":853.66666666666663},{"$f":"IF($D$2,('Dolny układ jezdny'!$D$13-3+'Dolny układ jezdny'!$D$19*V21)/'Dolny układ jezdny'!$D$18,('Dolny układ jezdny'!$D$13+'Dolny układ jezdny'!$D$19*V21)/'Dolny układ jezdny'!$D$18)","v":853.66666666666663},{"$f":"IF($D$2,('Dolny układ jezdny'!$D$13-3+'Dolny układ jezdny'!$D$19*W21)/'Dolny układ jezdny'!$D$18,('Dolny układ jezdny'!$D$13+'Dolny układ jezdny'!$D$19*W21)/'Dolny układ jezdny'!$D$18)","v":852.33333333333337},{"$f":"IF($D$2,('Dolny układ jezdny'!$D$13-3+'Dolny układ jezdny'!$D$19*X21)/'Dolny układ jezdny'!$D$18,('Dolny układ jezdny'!$D$13+'Dolny układ jezdny'!$D$19*X21)/'Dolny układ jezdny'!$D$18)","v":852.33333333333337},{"$f":"W5","v":852.33333333333337},{"$f":"X5","v":852.33333333333337},{"$f":"IF($D$2,('Dolny układ jezdny'!$D$13-3+'Dolny układ jezdny'!$D$19*AA21)/'Dolny układ jezdny'!$D$18,('Dolny układ jezdny'!$D$13+'Dolny układ jezdny'!$D$19*AA21)/'Dolny układ jezdny'!$D$18)","v":851.66666666666663},{"$f":"IF($D$2,('Dolny układ jezdny'!$D$13-3+'Dolny układ jezdny'!$D$19*AB21)/'Dolny układ jezdny'!$D$18,('Dolny układ jezdny'!$D$13+'Dolny układ jezdny'!$D$19*AB21)/'Dolny układ jezdny'!$D$18)","v":851.66666666666663},{"$f":"IF($D$2,('Dolny układ jezdny'!$D$13-3+'Dolny układ jezdny'!$D$19*AC21)/'Dolny układ jezdny'!$D$18,('Dolny układ jezdny'!$D$13+'Dolny układ jezdny'!$D$19*AC21)/'Dolny układ jezdny'!$D$18)","v":851.66666666666663},{"$f":"IF($D$2,('Dolny układ jezdny'!$D$13-3+'Dolny układ jezdny'!$D$19*AD21)/'Dolny układ jezdny'!$D$18,('Dolny układ jezdny'!$D$13+'Dolny układ jezdny'!$D$19*AD21)/'Dolny układ jezdny'!$D$18)","v":851.66666666666663},{"$f":"IF($D$2,('Dolny układ jezdny'!$D$13-3+'Dolny układ jezdny'!$D$19*AE21)/'Dolny układ jezdny'!$D$18,('Dolny układ jezdny'!$D$13+'Dolny układ jezdny'!$D$19*AE21)/'Dolny układ jezdny'!$D$18)","v":851.66666666666663},{"$f":"IF($D$2,('Dolny układ jezdny'!$D$13-3+'Dolny układ jezdny'!$D$19*AF21)/'Dolny układ jezdny'!$D$18,('Dolny układ jezdny'!$D$13+'Dolny układ jezdny'!$D$19*AF21)/'Dolny układ jezdny'!$D$18)","v":855},{"$f":"IF($D$2,('Dolny układ jezdny'!$D$13-3+'Dolny układ jezdny'!$D$19*AG21)/'Dolny układ jezdny'!$D$18,('Dolny układ jezdny'!$D$13+'Dolny układ jezdny'!$D$19*AG21)/'Dolny układ jezdny'!$D$18)","v":855},{"$f":"IF($D$2,('Dolny układ jezdny'!$D$13-3+'Dolny układ jezdny'!$D$19*AH21)/'Dolny układ jezdny'!$D$18,('Dolny układ jezdny'!$D$13+'Dolny układ jezdny'!$D$19*AH21)/'Dolny układ jezdny'!$D$18)","v":847.66666666666663},{"$f":"IF($D$2,('Dolny układ jezdny'!$D$13-3+'Dolny układ jezdny'!$D$19*AI21)/'Dolny układ jezdny'!$D$18,('Dolny układ jezdny'!$D$13+'Dolny układ jezdny'!$D$19*AI21)/'Dolny układ jezdny'!$D$18)","v":852.33333333333337},{"$f":"IF($D$2,('Dolny układ jezdny'!$D$13-3+'Dolny układ jezdny'!$D$19*AJ21)/'Dolny układ jezdny'!$D$18,('Dolny układ jezdny'!$D$13+'Dolny układ jezdny'!$D$19*AJ21)/'Dolny układ jezdny'!$D$18)","v":851},{"$f":"IF($D$2,('Dolny układ jezdny'!$D$13-3+'Dolny układ jezdny'!$D$19*AK21)/'Dolny układ jezdny'!$D$18,('Dolny układ jezdny'!$D$13+'Dolny układ jezdny'!$D$19*AK21)/'Dolny układ jezdny'!$D$18)","v":852.33333333333337},5,{"$f":"'Dolny układ jezdny'!G11","v":851}]
[6,"VISTA 18mm",null,true,null,"TAK/NIE",null,null,null,"WD",6,{"$f":"'Dolny układ jezdny'!$D$12-40","v":2460},{"$f":"'Dolny układ jezdny'!$D$12-40","v":2460},{"$f":"'Dolny układ jezdny'!$D$12-40","v":2460},{"$f":"'Dolny układ jezdny'!$D$12-40","v":2460},{"$f":"'Dolny układ jezdny'!$D$12-40","v":2460},{"$f":"'Dolny układ jezdny'!$D$12-40","v":2460},"-","-",{"$f":"'Dolny układ jezdny'!$D$12-40","v":2460},{"$f":"'Dolny układ jezdny'!$D$12-40","v":2460},{"$f":"'Dolny układ jezdny'!$D$12-40","v":2460},{"$f":"'Dolny układ jezdny'!$D$12-40","v":2460},{"$f":"'Dolny układ jezdny'!$D$12-40","v":2460},2460,2460,{"$f":"'Dolny układ jezdny'!$D$12-40","v":2460},{"$f":"'Dolny układ jezdny'!$D$12-40","v":2460},{"$f":"'Dolny układ jezdny'!$D$12-40","v":2460},{"$f":"'Dolny układ jezdny'!$D$12-40","v":2460},{"$f":"'Dolny układ jezdny'!$D$12-40","v":2460},{"$f":"'Dolny układ jezdny'!$D$12-40","v":2460},{"$f":"'Dolny układ jezdny'!$D$12-40","v":2460},{"$f":"'Dolny układ jezdny'!$D$12-40","v":2460},{"$f":"'Dolny układ jezdny'!$D$12-40","v":2460},{"$f":"'Dolny układ jezdny'!$D$12-40","v":2460},{"$f":"'Dolny układ jezdny'!$D$12-12","v":2488},6,{"$f":"'Dolny układ jezdny'!G12","v":2460}]
[7,"COTE 18mm",null,"Wybór łącznika",null,null,null,null,null,"SW18",7,{"$f":"L5-7","v":844},{"$f":"M5-36","v":819},"-",{"$f":"O5-36","v":819},{"$f":"P5-30","v":825},"-","-","-","-","-","-",{"$f":"W5-31","v":821.33333333333337},{"$f":"X5-31","v":821.33333333333337},821.33333333333337,821.33333333333337,{"$f":"AA5-36","v":815.66666666666663},"-",{"$f":"AC5-36","v":815.66666666666663},{"$f":"AD5-31","v":820.66666666666663},{"$f":"AE5-31","v":820.66666666666663},{"$f":"AF5-31","v":824},{"$f":"AG5-31","v":824},"-","-","-",{"$f":"AK5","v":852.33333333333337},7,{"$f":"'Dolny układ jezdny'!G13","v":844}]
[8,"COTE 16mm",null,null,1,"A-T18-300-XX",1,"A",null,"SW16",8,"-","-",{"$f":"N5-21","v":834},"-","-","-","-","-","-","-","-","-","-","-","-","-",{"$f":"AB5-21","v":830.66666666666663},"-",{"$f":"W8","v":"-"},{"$f":"X8","v":"-"},"-","-","-","-","-",{"$f":"AK5","v":852.33333333333337},8,{"$f":"'Dolny układ jezdny'!G14","v":"-"}]
[9,"NERO 18mm",null,null,null,"A-H18-300-XX",2,"A",null,"SW12",9,"-","-","-","-","-",{"$f":"Q5-7","v":848},"-","-","-","-","-","-","-","-","-","-","-","-","-","-","-","-","-","-","-","-",9,{"$f":"'Dolny układ jezdny'!G15","v":"-"}]
[10,"CARO 18mm",null,null,null,"A-H16-300-XX",3,"B",null,"SW10",10,"-","-","-","-","-","-","-","-",{"$f":"T5-21","v":831.33333333333337},{"$f":"U5-43","v":810.66666666666663},{"$f":"V5-43","v":810.66666666666663},"-","-","-","-","-","-","-","-","-","-","-",{"$f":"AH5-27","v":820.66666666666663},{"$f":"AI5-21","v":831.33333333333337},{"$f":"AJ5-36","v":815},"-",10,{"$f":"'Dolny układ jezdny'!G16","v":"-"}]
[11,"MITO/MITO PLUS",null,"-",null,"A-HRS18-YYY-XX",4,"C",null,"SW4",11,"-","-","-",{"$f":"O5-24","v":831},"-",{"$f":"Q5-32","v":823},"-","-",{"$f":"T5-24","v":828.33333333333337},{"$f":"U10-3","v":807.66666666666663},{"$f":"V10-3","v":807.66666666666663},"-",{"$f":"X5-23","v":829.33333333333337},"-",829.33333333333337,"-","-",{"$f":"AC5-23","v":828.66666666666663},"-",{"$f":"AE5-23","v":828.66666666666663},"-",{"$f":"AG5-23","v":832},{"$f":"AH5-30","v":817.66666666666663},{"$f":"AI5-24","v":828.33333333333337},{"$f":"AJ5-39","v":812},"-",11,{"$f":"'Dolny układ jezdny'!G17","v":"-"}]
[12,{"$f":"Opisy!A75","v":"------RÁMOWE 18mm--------------"},null,"-",null,"A-HR18-300-XX",5,"C",null,"WW18",12,{"$f":"L6-3","v":2457},{"$f":"M6-3","v":2457},"-",{"$f":"O6-69","v":2391},{"$f":"P6-3","v":2457},"-","-","-","-","-","-",{"$f":"M12","v":2457},{"$f":"O12","v":2391},2457,2391,{"$f":"W12","v":2457},"-",{"$f":"X12","v":2391},2457,2391,{"$f":"W12","v":2457},{"$f":"X12","v":2391},"-","-","-",{"$f":"AK6","v":2488},12,{"$f":"'Dolny układ jezdny'!G18","v":2457}]
[13,"NOVO S 18/4mm",null,"-",null,"A-HRS10-YYY-XX",6,"D",null,"WW16",13,"-","-",{"$f":"N6-3","v":2457},"-","-","-","-","-","-","-","-","-","-","-","-","-",{"$f":"N13","v":2457},"-","-","-","-","-","-","-","-",{"$f":"AK6","v":2488},13,{"$f":"'Dolny układ jezdny'!G19","v":"-"}]
[14,"VISTA 18/4mm",null,null,null,"A-HR10-YYY-XX",7,"D",null,"WW12",14,"-","-","-","-","-",{"$f":"Q6-3","v":2457},"-","-","-","-","-","-","-","-","-","-","-","-","-","-","-","-","-","-","-","-",14,{"$f":"'Dolny układ jezdny'!G20","v":"-"}]
[15,"COTE 18/4mm",null,null,null,"A-HR10FL-YYY-XX",8,"E",null,"WW10",15,"-","-","-","-","-","-","-","-",{"$f":"T6-60","v":2400},{"$f":"T15","v":2400},{"$f":"U15","v":2400},"-","-","-","-","-","-","-","-","-","-","-",{"$f":"AH6-60","v":2400},{"$f":"AI6-60","v":2400},{"$f":"AJ6-5","v":2455},"-",15,{"$f":"'Dolny układ jezdny'!G21","v":"-"}]
{"$rows_left_out":32}
{"sheet":"OVERLINE","index":2,"n_rows":70,"n_cols":13,"rows_kept":70,"cut":false,"hidden":false,"merged":[[31,8,31,10],[13,6,25,8],[13,2,25,5],[30,4,30,6],[33,4,33,6],[32,4,32,6],[31,4,31,6],[39,11,39,12],[39,5,39,6],[43,7,43,8],[20,12,21,13],[16,12,17,13],[18,12,19,13],[34,4,34,6],[16,11,17,11],[18,11,19,11],[20,9,21,9],[20,10,21,10],[20,11,21,11],[16,9,17,9],[16,10,17,10],[18,10,19,10],[18,9,19,9],[37,7,37,12],[43,9,43,10],[43,11,43,12],[57,5,57,6],[53,7,53,8],[57,9,57,10],[57,11,57,12],[43,5,43,6],[39,7,39,8],[52,5,52,12],[53,5,53,6],[57,7,57,8],[53,9,53,10],[53,11,53,12],[38,5,38,12],[39,9,39,10],[62,2,63,9],[48,10,49,11],[48,12,49,12],[62,10,63,11],[62,12,63,12],[51,7,51,12],[48,2,49,9]]}
[]
[]
[]
[]
[]
[]
[]
[]
[null,null,null,"1.",{"$f":"Opisy!A15","v":"Vyber profil"}]
[]
[]
[null,null,null,"2.",{"$f":"Opisy!A81","v":"Rozmery podľa:"}]
[]
[null,null,{"$f":"Opisy!A82","v":"dutiny"},null,null,null,{"$f":"Opisy!A83","v":"Korpusu skrine"}]
[]
{"$rows_left_out":56}
{"sheet":"Overline - Obliczenia","index":3,"n_rows":23,"n_cols":22,"rows_kept":23,"cut":false,"hidden":true,"merged":[[21,5,21,9],[15,5,16,6],[11,5,11,7],[12,5,12,7],[13,5,13,7],[7,5,7,6],[8,5,8,6],[9,5,9,6],[5,5,5,7],[1,14,1,21],[2,14,2,15],[6,16,6,17],[2,18,2,19],[2,20,2,21],[1,5,1,7],[4,5,4,7],[3,5,3,7],[2,5,2,7],[2,16,2,17],[17,14,17,15],[13,16,13,17],[17,18,17,19],[17,20,17,21],[6,14,6,15],[6,18,6,19],[6,20,6,21],[12,14,12,21],[13,14,13,15],[17,16,17,17],[13,18,13,19],[13,20,13,21]]}
[]
[null,"Wybrany system:",1,{"$f":"VLOOKUP(C2,A8:B38,2,FALSE)","v":"OVERILINE"},null,"Grubość płyty na korpus Gp",null,null,{"$f":"VLOOKUP(H17,F18:G20,2,FALSE)","v":18},null,null,null,null,null,"Wymiary szafy - drzwi nakładane"]
[null,"Typ zabudowy:",1,null,null,{"$f":"Opisy!A148","v":"Hrúbka horného panelu:"},null,null,{"$f":"VLOOKUP(J17,F18:G20,2,0)","v":18},null,null,null,null,null,"Korpus:",null,"Wymiary cokołu",null,"Bok lewy",null,"Przegrody pionowe"]
[null,"Układ drzwi",null,null,null,"Grubość płyty drzwi Gd",null,null,{"$f":"VLOOKUP(I17,F18:G20,2,FALSE)","v":18},null,null,null,null,null,"Wysokość Ws",{"$f":"Wys.szafy","v":2275},"Wysokość",{"$f":"Wys.cokolu","v":100},"Wysokość",{"$f":"Wys.szafy","v":2275},"Wysokość",{"$f":"Wys.uzyt.szafy","v":2094}]
[null,null,null,null,null,"Wysokość cokołu Hc ",null,null,{"$f":"OVERLINE!H34","v":100},null,null,null,null,null,"Szerokość Ss",{"$f":"Szer.szafy","v":1993},"Długość",{"$f":"P9","v":1957},"Głębokość",{"$f":"P10+35","v":678},"Głębokość",{"$f":"P10-10","v":633}]
[null,"Systemy podwieszane",null,null,null,"Szerokość zakładki Z",null,null,{"$f":"OVERLINE!H35","v":20},null,null,null,null,null,"Głębokość Gs",{"$f":"Gleb.szafy","v":700},"Grubość",{"$f":"Grub.plyty.korp","v":18},"Grubość",{"$f":"Grub.plyty.korp","v":18},"Grubość",{"$f":"Grub.plyty.korp","v":18}]
[null,null,null,null,null,null,null,null,null,null,null,null,null,null,"Wnętrze korpusu:",null,"Wieniec górny i dolny",null,"Bok prawy",null,"Wymiary drzwi"]
[null,null,null,null,null,"Wysokość szafy",null,{"$f":"IF(AND(OR(Wybrany_System_podw=1,Wybrany_System_podw=2),Typ_zabudowy=1),Wys.wprowadzana-25,Wys.wprowadzana)","v":2275},null,null,null,null,null,null,"Wysokość Wu",{"$f":"Wys.uzyt.szafy","v":2094},"Szerokość",{"$f":"P9","v":1957},"Wysokość",{"$f":"Wys.szafy","v":2275},"Wysokość Wd",{"$f":"IF(Wybrany_System_podw=1,Wys.szafy-Wys.cokolu-Grub.plyty.korp+41,IF(Wybrany_System_podw=2,Wys.szafy-Wys.cokolu-Grub.plyty.korp+39,\"-\"))","v":2198}]
[1,"OVERILINE",null,null,null,"Szerokość szafy",null,{"$f":"IF(AND(OR(Wybrany_System_podw=1,Wybrany_System_podw=2),Typ_zabudowy=1),Szer.wprowadzana-7,Szer.wprowadzana)","v":1993},null,null,null,null,null,null,"Szerokość Sw",{"$f":"Szer.uzyt.szafy","v":1957},"Głębokość",{"$f":"P10","v":643},"Głębokość",{"$f":"P10+6","v":649},"Szerokość Sd",{"$f":"(Szer.szafy+Szer.zakladki)/2","v":1006.5}]
[2,"OVERLINE PLUS",null,null,null,"Głębokość szafy",null,{"$f":"Gleb.wprowadzana","v":700},null,null,null,null,null,null,"Głębokość Gu",{"$f":"Gleb.uzyt.szafy+5","v":643},"Grubość Dolnego",{"$f":"Grub.plyty.korp","v":18},"Grubość",{"$f":"Grub.plyty.korp","v":18},"Grubość Gd",{"$f":"Grub.drzwi","v":18}]
[null,null,null,null,null,null,null,null,null,null,null,null,null,null,null,null,"Grubość górnego",{"$f":"Grub.wien.gorn","v":18}]
[null,null,null,null,null,"Wysokość użyteczna szafy",null,null,{"$f":"Wys.szafy-Wys.cokolu-(Grub.wien.gorn+Grub.plyty.korp)-45","v":2094}]
[null,null,null,null,null,"Szerokość użyteczna szafy",null,null,{"$f":"Szer.szafy-2*Grub.plyty.korp","v":1957},null,null,null,null,null,"Wymiary szafy - drzwi wpuszczane"]
[null,null,null,null,null,"Głębokość użyteczna szafy",null,null,{"$f":"Gleb.szafy-Grub.drzwi-44","v":638},null,null,null,null,null,"Korpus:",null,"Wymiary cokołu",null,"Bok lewy",null,"Przegrody pionowe"]
[null,null,null,null,null,null,null,null,null,null,null,null,null,null,"Wysokość Ws",{"$f":"Wys.szafy","v":2275},"Wysokość",{"$f":"Wys.cokolu","v":100},"Wysokość",{"$f":"Wys.szafy","v":2275},"Wysokość",{"$f":"Wys.uzyt.szafy","v":2094}]
{"$rows_left_out":9}
{"sheet":"QUANTUM","index":4,"n_rows":70,"n_cols":14,"rows_kept":70,"cut":false,"hidden":false,"merged":[[15,0,22,0],[23,0,29,0],[23,1,29,1],[15,2,22,3],[23,2,29,3],[49,1,49,4],[53,1,53,4],[57,1,57,4],[37,1,37,4],[44,1,44,4],[42,1,42,5],[35,1,35,5],[31,7,31,12],[32,7,32,12],[35,7,35,13],[34,7,34,13],[24,8,29,11],[15,1,22,1],[15,4,22,5],[23,4,29,5],[7,9,9,10],[7,11,9,12],[23,8,23,11],[16,8,16,11],[17,8,21,11],[58,6,58,7],[59,6,59,7],[57,6,57,7],[33,7,33,12],[39,7,40,13],[36,12,36,13],[50,6,53,6],[50,7,53,7],[49,6,49,8],[50,8,53,8],[36,7,36,11]]}
[]
[]
[]
[]
[]
[]
[]
[]
[]
[]
[]
["1.",{"$f":"Opisy!A15","v":"Vyber profil"}]
[]
["2.",{"$f":"Opisy!A119","v":"Možnosti montáže:"},null,null,null,null,null,"3.",{"$f":"Opisy!A128","v":"Výber montáže"}]
[]
{"$rows_left_out":56}
{"sheet":"Quantum - obliczenia","index":5,"n_rows":51,"n_cols":12,"rows_kept":51,"cut":false,"hidden":true,"merged":[[40,4,40,7],[0,6,0,8],[0,9,0,10],[6,5,6,8],[10,5,10,8],[14,5,14,8]]}
[null,"Wybrany system",4,{"$f":"VLOOKUP(C1,A3:B7,2,FALSE)","v":"QUANTUM R + ARCO"},null,null,"Opcje montażu",null,null,"Wariant zabudowy"]
[null,null,null,null,null,null,1,2,3,4,5,1]
[1,{"$f":"Opisy!A156","v":"BEZRÁMOVÉ"},"WO",{"$f":"QUANTUM!F32","v":2200},null,"SD",{"$f":"HLOOKUP($C$26,J2:K3,2,FALSE)","v":1246},{"$f":"HLOOKUP($C$26,J2:K3,2,FALSE)","v":1246},{"$f":"HLOOKUP($C$26,J2:K3,2,FALSE)","v":1246},{"$f":"Szer.Otw.przej+Szer.zakl.przej*2","v":1292},{"$f":"Szer.Otw.przej+Szer.zakl.przej","v":1246},2]
[2,"QUANTUM","SO",{"$f":"QUANTUM!F33","v":1200},null,"WD",{"$f":"IF(AND(Wybr.system.przejsciowy=2,Opcja.montazu=1),Wys.otw.przej-59,Wys.otw.przej-48)","v":2152},{"$f":"IF(AND(Wybr.system.przejsciowy=2,Opcja.montazu=2),Wys.otw.przej-61,Wys.otw.przej-50)","v":2150},{"$f":"Wys.otw.przej+20","v":2220},"-","-",3]
[3,{"$f":"Opisy!A157","v":"RÁMOVÉ"},"X",{"$f":"QUANTUM!F34","v":46},null,"DT",{"$f":"HLOOKUP($C$26,$J$2:$K$5,4,FALSE)","v":2446},{"$f":"HLOOKUP($C$26,$J$2:$K$5,4,FALSE)","v":2446},{"$f":"HLOOKUP($C$26,$J$2:$K$5,4,FALSE)","v":2446},{"$f":"Szer.Otw.przej+J3","v":2492},{"$f":"Szer.Otw.przej+K3","v":2446},4]
[4,"QUANTUM R + ARCO",null,null,null,null,null,null,null,null,null,5]
[5,"QUANTUM R + FALDA",null,null,null,{"$f":"Opisy!C134","v":"Wymiary wypełnienia z płyty 10mm"},null,null,null,null,null,6]
[null,null,null,null,null,"SW10",{"$f":"G3-43","v":1203},{"$f":"H3-43","v":1203},1203,null,null,7]
[null,"Opcje montażu",3,null,null,"WW10",{"$f":"G4-93","v":2059},{"$f":"H4-93","v":2057},2127,null,null,8]
[null,{"$f":"Opisy!A120","v":"Priama montáž na strop"},null,null,null,null,null,null,null,null,null,9]
[null,{"$f":"Opisy!A121","v":"Montáž na stenu - horné uchytenie"},null,null,null,{"$f":"Opisy!C135","v":"Wymiary wypełnienia ze szkła 4mm"},null,null,null,null,null,10]
[null,{"$f":"Opisy!A122","v":"Montáž do steny - bočné uchytenie"},null,null,null,"SW4",{"$f":"G3-46","v":1200},{"$f":"H3-46","v":1200},1200,null,null,11]
[null,null,null,null,null,"WW4",{"$f":"G4-94","v":2058},{"$f":"H4-94","v":2056},2126,null,null,12]
[null,"Grubość wypełnienia",5,null,null,null,null,null,null,null,null,13]
[1,{"$f":"B5","v":"RÁMOVÉ"},null,null,null,{"$f":"Opisy!C136","v":"Wymiary profili aluminiowych"},null,null,null,null,null,14]
{"$rows_left_out":37}
{"sheet":"Opisy","index":6,"n_rows":478,"n_cols":11,"rows_kept":478,"cut":false,"hidden":true,"merged":[]}
["Wybór języka",9,null,null,{"$f":"Opisy!A52","v":"chyba!"}]
[null,"Polski",null,null,{"$f":"Opisy!A53","v":"Chybný \"H\" profil!"}]
[null,"English"]
[null,"Русский"]
[null,"Deutsch"]
[null,"Français"]
[null,{"$f":"Tabela1[[#Headers],[Українська]]","v":"Українська"}]
[null,"Lietuvos"]
[null,"Slovenski"]
[null,"Slovenský"]
[]
[null,null,"PL","EN","RU","DE","FR","Українська","LT","SLO","SK"]
[null,null,1,2,3,4,5,6,7,8,9]
["Tekst do wstawienia","Nr wiersza","PL","EN","RU","DE","FR","Українська","LT","SLO","SK"]
[{"$f":"HLOOKUP($B$1,$C$13:$K$478,$B15,FALSE)","v":"Vyber profil"},3,"Wybierz system:","Choose a system:","Выберите тип системы:","System auswählen:","Choix système:","Виберіть систему:","Pasirinkite sistema:","Izberite sistem:","Vyber profil"]
{"$rows_left_out":463}